�s���{���R�[�h���͎s�撬���R�[�h,NO,�s���{����,�s�撬����,����,����_�J�i,����_�ʏ�,POI�R�[�h,���ݒn,����,�ܓx,�o�x,�d�b�ԍ�,�����ԍ�,�@�l�ԍ�,�c�̖�,���p�\�j��,�J�n����,�I������,���p�\���ԓ��L����,����,�o���A�t���[���,URL,���l,�����\�ŏ�����,0��,1��,2��,3��,4��,5��,�v,�ތ^,�����ۈ�J�n����,�����ۈ�I������,�ً}�ꎞ�ۈ�,�ꎞ�ۈ�,�ݒu��,�^�c��
131105,1,�����s,�ڍ���,�w�h�i�[�T���[�@�ڍ��t��ۈ牀,�K�N�G�C�i�[�T���[�@���O���A�I�o�_�C�z�C�N�G��,,1402a,�����s�ڍ���t��O����10��9��,,35.650818667,139.690033753,03-5459-1317,,1.0132E+12,������Њw�h,,7:15,18:30,���j��~�y�j��,,,https://gakuei-n.com/location.html,,90����,6,6,7,,,,19,A�^,7:00/18:30,7:30/20:00,��,��,,������Њw�h
131105,2,�����s,�ڍ���,�r�[�t�F�A�ڍ��ۈ牀,�r�[�t�F�A���O���z�C�N�G��,,1402a,�����s�ڍ���ڍ��񒚖�12��16��,,35.634884797,139.70735945,03-6712-2768,,7.0127E+12,�r�[�t�F�A�������,,7:15,18:15,���j��~�y�j��,,,https://bflove.com/hoikuen/meguro.html,,90����,6,7,6,,,,19,A�^,18:15,19:15,��,��,,�r�[�t�F�A�������
131105,3,�����s,�ڍ���,�s�������ۈ牀,�t�h�E�T�c�L�z�C�N�G��,,1402a,�����s�ڍ��扺�ڍ��ܒ���18��4�����L1,,35.630304328,139.702387011,03-6303-0972,,1.03001E+12,�Љ���@�l������,,7:30,18:30,���j��~�y�j��,,,https://www.fudou-satuki.com/,,90����,6,6,7,,,,19,A�^,18:30,19:30,��,��,,�Љ���@�l������
131105,4,�����s,�ڍ���,�r�[�t�F�A�����ۈ牀,�r�[�t�F�A�i�J�}�`�z�C�N�G��,,1402a,�����s�ڍ��撆���꒚��25��16��,,35.629601047,139.698359306,03-5722-1551,,7.0127E+12,�r�[�t�F�A�������,,7:15,18:15,���j��~�y�j��,,,https://bflove.com/hoikuen/nakacho.html,,90����,6,6,7,,,,19,A�^,18:15,19:15,��,��,,�r�[�t�F�A�������
131105,5,�����s,�ڍ���,�ۈ烋�[���@�ڍ��{��,�z�C�N���[���@���O���z���`���E,,1402a,�����s�ڍ���ڍ��{���Z����13��20��,,35.621446606,139.69517445,03-5725-3521,,3.18001E+12,�Љ���@�l������,,7:15,18:15,���j��~�y�j��,,,http://www.sky-nursery.org/megurohoncho/,,90����,6,6,7,,,,19,A�^,18:15,19:15,��,��,,�Љ���@�l������
131105,6,�����s,�ڍ���,�x�C�r�[����,�x�C�r�[����,,1402a,�����s�ڍ����Ԉ꒚��15��3��,,35.625749161,139.685987992,03-3713-8000,,8.011E+12,������Ѓx�C�r�[����,,7:30,18:30,���j��~�y�j��,,,https://babyone.webnode.jp/,,90����,7,6,6,,,,19,A�^,18:30,19:30,��,��,,������Ѓx�C�r�[����
131105,7,�����s,�ڍ���,BUNBUN�@GARDEN�@�w�|��w��,�u���u���@�K�[�f���@�K�N�Q�C�_�C�K�N�G��,,1402a,�����s�ڍ����ԎO����14��4��,,35.629675203,139.684378592,03-6412-8332,,1.0132E+12,������ЃA�U�[�X,,7:30,18:30,���j��~�y�j��,,,http://bunbun-kids.jp/,,90����,2,5,5,,,,12,A�^,18:30,19:30,��,��,,������ЃA�U�[�X
131105,8,�����s,�ڍ���,�}�U�[�O�[�X�s����w��,�}�U�[�O�[�X�g���c�_�C�K�N�G��,,1402a,�����s�ڍ��敽���꒚��26��18��,,35.617667514,139.676533028,03-5726-9652,,5.021E+12,������Ѓ}�U�[�O�[�X,,7:15,18:15,���j��~�y�j��,,,https://mothergoose.jp/company/44/,,90����,5,7,7,,,,19,A�^,18:15,20:00,��,��,,�L����Ѓ}�U�[�O�[�X
131105,9,�����s,�ڍ���,�E�B�Y�u�b�N�ۈ牀�剪�R,�E�B�Y�u�b�N�z�C�N�G���I�I�I�J���},,1402a,�����s�ڍ���剪�R�񒚖�2��14��,,35.608166053,139.684353908,03-6386-5044,,2.0109E+12,������ЃA�C�E�G�X�E�V�[,,7:15,18:15,���j��~�y�j��,,,https://wb-hoikuen.jp/tokyo/ookayama,,90����,3,8,8,,,,19,A�^,18:15,19:00,��,��,,������ЃA�C�E�G�X�E�V�[
131105,10,�����s,�ڍ���,���j�J�΂��u��,���j�J�~�h���K�I�J�G��,,1402a,�����s�ڍ���΂��u�񒚖�7��20��,,35.609630122,139.674427267,03-6421-1231,,6.12E+12,������Ѓ��j�J,,7:15,18:15,���j��~�y�j��,,,https://www.monica.co.jp/facility/midorigaoka/,,57����,6,6,7,,,,19,A�^,18:15,19:15,��,��,,������Ѓ��j�J
131105,11,�����s,�ڍ���,�؉��̕ۈ牀�@�s����w,�L�m�V�^�m�z�C�N�G���@�g���c�_�C�K�N,,1402a,�����s�ڍ��撆���񒚖�13��18��,,35.616622931,139.675509778,03-3723-0223,,7.0111E+12,������Ж؉��̕ۈ�,,7:15,18:15,���j��~�y�j��,,,https://www.kinoshita-hoiku.com/facility/toritsu-daigaku,,90����,3,8,8,,,,19,A�^,18:15,19:15,��,��,,������Ж؉��̕ۈ�
131105,12,�����s,�ڍ���,�w�h�i�[�T���[���_�ۈ牀,�K�N�G�C�i�[�T���[���N���z�C�N�G��,,1402a,�����s�ڍ��攪�_�꒚��12��9��,,35.616807789,139.672748522,03-5731-0231,,1.0132E+12,������Њw�h,,7:15,18:15,���j��~�y�j��,,,https://gakuei-n.com/location.html,,90����,6,6,7,,,,19,A�^,18:15,19:30,��,��,,������Њw�h
131105,13,�����s,�ڍ���,���ǂ����u�ۈ牀�w�|��w��,�R�h���K�I�J�z�C�N�G���K�N�Q�C�_�C�K�N�G��,,1402a,�����s�ڍ���蕶�J�Z����1��24��,,35.6271378,139.685099308,03-6451-2837,,1.0113E+12,������Ѓ`���C���h�r�W����,,7:30,18:30,���j��~�y�j��,,,https://childvision.jp/school/gakugeidaigaku/,,90����,2,5,5,,,,12,A�^,�Ȃ�,,��,��,,������Ѓ`���C���h�r�W����
131105,14,�����s,�ڍ���,�݂݂�񃋁[��,�~�~�������[��,,1402a,�����s�ڍ����ԎO����23��14��,,35.628327361,139.680641103,03-3712-8450,,1.03E+12,������ЃG���G�t�n�C�c,,7:15,19:15,���j��~�y�j��,,,http://www.mimiyonroom-child.jp/,8���Ԓ�����ꍇ�͉����ۈ�,90����,2,2,2,,,,6,B�^,���{,���{,��,��,,������ЃG���G�t�n�C�c
131105,15,�����s,�ڍ���,�R�r�[�X�}�C���L�b�Y���݂߂���,�R�r�[�X�}�C���L�b�Y�J�~���O��,,1402a,�����s�ڍ����ڍ��ܒ���26��6��,,35.641953119,139.687594433,03-6452-3781,,8.04E+12,������ЃR�r�[�A���h�A�\�V�G,,8:00,18:00,���j��~�y�j��,,,https://www.coby.jp/institute/smile-kids-kamimeguro/,,57����,*,*,*,,,,9,C�^,18:00,21:00,��,��,,������ЃR�r�[�A���h�A�\�V�G
